{"text_format":"3","workbook":"xlsx","n_sheets":5,"sheets":["1. Check-list","2. Functions","3. Admin Info","4. Motivation","Liste"],"read":"whole","date_system":"1900"}

{"sheet":"1. Check-list","index":0,"n_rows":7,"n_cols":2,"rows_kept":7}
["2021 Jean-Pictet Competition - application form for volunteers"]
["Please complete the fields in the three other tabs of this document. This will automatically update the check-list below. "]
["This Excel document must be sent back, once completed, to christophe@concourspictet.org, together with a CV, at the latest on 1st November."]
[]
["Proposed functions",{"$f":"IF(OR('2. Functions'!B3=\"\",'2. Functions'!B4=\"\",'2. Functions'!B5=\"\",'2. Functions'!B6=\"\",'2. Functions'!B8=\"\",'2. Functions'!B9=\"\",'2. Functions'!B11=\"\",'2. Functions'!B12=\"\"),\"Information is missing\",\"OK\")","v":"Information is missing"}]
["Administrative information",{"$f":"IF(OR('3. Admin Info'!B2=\"\",'3. Admin Info'!B3=\"\",'3. Admin Info'!B4=\"\",'3. Admin Info'!B5=\"\",'3. Admin Info'!B6=\"\",'3. Admin Info'!C6=\"\",'3. Admin Info'!D6=\"\",'3. Admin Info'!B7=\"\",'3. Admin Info'!B9=\"\",'3. Admin Info'!B10=\"\",'3. Admin Info'!B11=\"\",'3. Admin Info'!B12=\"\",'3. Admin Info'!B13=\"\"),\"Information is missing\",\"OK\")","v":"Information is missing"}]
["Motivation (number of words)",{"$f":"IF('4. Motivation'!A3<>\"\",(LEN('4. Motivation'!A3)-LEN(SUBSTITUTE('4. Motivation'!A3,\" \",\"\"))+1),0)","v":0}]

{"sheet":"2. Functions","index":1,"n_rows":13,"n_cols":1,"rows_kept":13}
["Proposed functions"]
["Do you apply to be…"]
["A judge?"]
["A tutor?"]
["A \"Petits-Bras\"?"]
["A member of the Kitchen?"]
["Can you carry out these functions…"]
["In French?"]
["In English?"]
["Selection of the edition"]
["Is attending the 35th edition (Albania) possible?"]
["Is attending the 36th edition (Indonesia) possible?"]
["Additional comments (if any)"]

{"sheet":"3. Admin Info","index":2,"n_rows":14,"n_cols":1,"rows_kept":14}
["Administrative information"]
["First name"]
["Usual first name (if applicable), e.g. Mike for Michael…"]
["Family name"]
["Gender"]
["Date of birth"]
["Nationality"]
["Second nationality (if any)"]
["Email"]
["Phone number"]
["Country from which you will travel?"]
["City from which you will travel?"]
["Percentage of your trip costs you expect us to cover? NB: we do cover your accommodation and meals costs for the duration of the Competition."]
["Additional comments (if any)"]

{"sheet":"4. Motivation","index":3,"n_rows":2,"n_cols":1,"rows_kept":2}
["Motivation"]
["Please explain why you would be a great choice for the forthcoming Competition, in the function(s) you propose to fulfill. (1000 words maximum)"]

{"sheet":"Liste","index":4,"n_rows":200,"n_cols":10,"rows_kept":200,"hidden":true}
[]
["Afghanistan",1,"January",1940,"Possible (scroll if needed)","No preference (scroll if needed)","Female","0 %","yes, no preference","yes, as a preference"]
["Albania",2,"February",1941,"Impossible (scroll if needed)","35th edition (Albania)","Male","25 %","yes, as a preference","yes, as a second choice"]
["Algeria",3,"March",1942,null,"36th edition (Indonesia)","Other choice","50 %","yes, as a second choice","no"]
["Andorra",4,"April",1943,{"$nulls":3},"75 %","no"]
["Angola",5,"May",1944,{"$nulls":3},"100 %"]
["Antigua and Barbuda",6,"June",1945]
["Argentina",7,"July",1946]
["Armenia",8,"August",1947]
["Australia",9,"September",1948]
["Austria",10,"October",1949]
["Azerbaijan",11,"November",1950]
["Bahamas",12,"December",1951]
["Bahrain",13,null,1952]
["Bangladesh",14,null,1953]
["Barbados",15,null,1954]
["Belarus",16,null,1955]
["Belgium",17,null,1956]
["Belize",18,null,1957]
["Benin",19,null,1958]
["Bhutan",20,null,1959]
["Bolivia (Plurinational State of)",21,null,1960]
["Bosnia and Herzegovina",22,null,1961]
["Botswana",23,null,1962]
["Brazil",24,null,1963]
["Brunei Darussalam",25,null,1964]
["Bulgaria",26,null,1965]
["Burkina Faso",27,null,1966]
["Burundi",28,null,1967]
["Cabo Verde",29,null,1968]
["Cambodia",30,null,1969]
["Cameroon",31,null,1970]
["Canada",null,null,1971]
["Central African Republic",null,null,1972]
["Chad",null,null,1973]
["Chile",null,null,1974]
["China",null,null,1975]
["Colombia",null,null,1976]
["Comoros",null,null,1977]
["Congo",null,null,1978]
["Cook Islands",null,null,1979]
["Costa Rica",null,null,1980]
["Côte D'Ivoire",null,null,1981]
["Croatia",null,null,1982]
["Cuba",null,null,1983]
["Cyprus",null,null,1984]
["Czech Republic",null,null,1985]
["Democratic People's Republic of Korea",null,null,1986]
["Democratic Republic of the Congo",null,null,1987]
["Denmark",null,null,1988]
["Djibouti",null,null,1989]
["Dominica",null,null,1990]
["Dominican Republic",null,null,1991]
["Ecuador",null,null,1992]
["Egypt",null,null,1993]
["El Salvador",null,null,1994]
["Equatorial Guinea",null,null,1995]
["Eritrea",null,null,1996]
["Estonia",null,null,1997]
["Eswatini",null,null,1998]
["Ethiopia",null,null,1999]
["Fiji",null,null,2000]
["Finland",null,null,2001]
["France",null,null,2002]
["Gabon",null,null,2003]
["Gambia (Republic of The)",null,null,2004]
["Georgia",null,null,2005]
["Germany"]
["Ghana"]
["Greece"]
["Grenada"]
["Guatemala"]
["Guinea"]
["Guinea Bissau"]
["Guyana"]
["Haiti"]
["Holy See"]
["Honduras"]
["Hungary"]
["Iceland"]
["India"]
["Indonesia"]
["Iran (Islamic Republic of)"]
["Iraq"]
["Ireland"]
["Israel"]
["Italy"]
["Jamaica"]
["Japan"]
["Jordan"]
["Kazakhstan"]
["Kenya"]
["Kiribati"]
["Kosovo"]
["Kuwait"]
["Kyrgyzstan"]
["Lao People’s Democratic Republic"]
["Latvia"]
["Lebanon"]
["Lesotho"]
["Liberia"]
["Libya"]
["Liechtenstein"]
["Lithuania"]
["Luxembourg"]
["Madagascar"]
["Malawi"]
["Malaysia"]
["Maldives"]
["Mali"]
["Malta"]
["Marshall Islands"]
["Mauritania"]
["Mauritius"]
["Mexico"]
["Micronesia (Federated States of)"]
["Monaco"]
["Mongolia"]
["Montenegro"]
["Morocco"]
["Mozambique"]
["Myanmar"]
["Namibia"]
["Nauru"]
["Nepal"]
["Netherlands"]
["New Zealand"]
["Nicaragua"]
["Niger"]
["Nigeria"]
["Niue"]
["North Macedonia"]
["Norway"]
["Oman"]
["Pakistan"]
["Palau"]
["Palestine"]
["Panama"]
["Papua New Guinea"]
["Paraguay"]
["Peru"]
["Philippines"]
["Poland"]
["Portugal"]
["Qatar"]
["Republic of Korea"]
["Republic of Moldova"]
["Romania"]
["Russian Federation"]
["Rwanda"]
["Saint Kitts and Nevis"]
["Saint Lucia"]
["Saint Vincent and the Grenadines"]
["Samoa"]
["San Marino"]
["Sao Tome and Principe"]
["Saudi Arabia"]
["Senegal"]
["Serbia"]
["Seychelles"]
["Sierra Leone"]
["Singapore"]
["Slovakia"]
["Slovenia"]
["Solomon Islands"]
["Somalia"]
["South Africa"]
["South Sudan"]
["Spain"]
["Sri Lanka"]
["Sudan"]
["Suriname"]
["Sweden"]
["Switzerland"]
["Syrian Arab Republic"]
["Taiwan"]
["Tajikistan"]
["Thailand"]
["Timor-Leste"]
["Togo"]
["Tonga"]
["Trinidad and Tobago"]
["Tunisia"]
["Turkey"]
["Turkmenistan"]
["Tuvalu"]
["Uganda"]
["Ukraine"]
["United Arab Emirates"]
["United Kingdom of Great Britain and Northern Ireland"]
["United Republic of Tanzania"]
["United States of America"]
["Uruguay"]
["Uzbekistan"]
["Vanuatu"]
["Venezuela, Bolivarian Republic of"]
["Viet Nam"]
["Yemen"]
["Zambia"]
["Zimbabwe"]